CMakeError.log

Determining if the include file malloc/malloc.h exists failed with the following output:
Change Dir: /home/andreagenor/code/external/llvm/build/CMakeFiles/CMakeTmp

Run Build Command(s):/usr/bin/gmake -f Makefile cmTC_e1341/fast && /usr/bin/gmake  -f CMakeFiles/cmTC_e1341.dir/build.make CMakeFiles/cmTC_e1341.dir/build
gmake[1]: Entering directory '/home/andreagenor/code/external/llvm/build/CMakeFiles/CMakeTmp'
Building C object CMakeFiles/cmTC_e1341.dir/CheckIncludeFile.c.o
/usr/bin/cc    -o CMakeFiles/cmTC_e1341.dir/CheckIncludeFile.c.o -c /home/andreagenor/code/external/llvm/build/CMakeFiles/CMakeTmp/CheckIncludeFile.c
/home/andreagenor/code/external/llvm/build/CMakeFiles/CMakeTmp/CheckIncludeFile.c:1:10: fatal error: malloc/malloc.h: No such file or directory
    1 | #include <malloc/malloc.h>
      |          ^~~~~~~~~~~~~~~~~
compilation terminated.
gmake[1]: *** [CMakeFiles/cmTC_e1341.dir/build.make:78: CMakeFiles/cmTC_e1341.dir/CheckIncludeFile.c.o] Error 1
gmake[1]: Leaving directory '/home/andreagenor/code/external/llvm/build/CMakeFiles/CMakeTmp'
gmake: *** [Makefile:127: cmTC_e1341/fast] Error 2



Determining if the include file mach/mach.h exists failed with the following output:
Change Dir: /home/andreagenor/code/external/llvm/build/CMakeFiles/CMakeTmp

Run Build Command(s):/usr/bin/gmake -f Makefile cmTC_4f01a/fast && /usr/bin/gmake  -f CMakeFiles/cmTC_4f01a.dir/build.make CMakeFiles/cmTC_4f01a.dir/build
gmake[1]: Entering directory '/home/andreagenor/code/external/llvm/build/CMakeFiles/CMakeTmp'
Building C object CMakeFiles/cmTC_4f01a.dir/CheckIncludeFile.c.o
/usr/bin/cc    -o CMakeFiles/cmTC_4f01a.dir/CheckIncludeFile.c.o -c /home/andreagenor/code/external/llvm/build/CMakeFiles/CMakeTmp/CheckIncludeFile.c
/home/andreagenor/code/external/llvm/build/CMakeFiles/CMakeTmp/CheckIncludeFile.c:1:10: fatal error: mach/mach.h: No such file or directory
    1 | #include <mach/mach.h>
      |          ^~~~~~~~~~~~~
compilation terminated.
gmake[1]: *** [CMakeFiles/cmTC_4f01a.dir/build.make:78: CMakeFiles/cmTC_4f01a.dir/CheckIncludeFile.c.o] Error 1
gmake[1]: Leaving directory '/home/andreagenor/code/external/llvm/build/CMakeFiles/CMakeTmp'
gmake: *** [Makefile:127: cmTC_4f01a/fast] Error 2



Determining if the include file histedit.h exists failed with the following output:
Change Dir: /home/andreagenor/code/external/llvm/build/CMakeFiles/CMakeTmp

Run Build Command(s):/usr/bin/gmake -f Makefile cmTC_a316f/fast && /usr/bin/gmake  -f CMakeFiles/cmTC_a316f.dir/build.make CMakeFiles/cmTC_a316f.dir/build
gmake[1]: Entering directory '/home/andreagenor/code/external/llvm/build/CMakeFiles/CMakeTmp'
Building C object CMakeFiles/cmTC_a316f.dir/CheckIncludeFile.c.o
/usr/bin/cc    -o CMakeFiles/cmTC_a316f.dir/CheckIncludeFile.c.o -c /home/andreagenor/code/external/llvm/build/CMakeFiles/CMakeTmp/CheckIncludeFile.c
/home/andreagenor/code/external/llvm/build/CMakeFiles/CMakeTmp/CheckIncludeFile.c:1:10: fatal error: histedit.h: No such file or directory
    1 | #include <histedit.h>
      |          ^~~~~~~~~~~~
compilation terminated.
gmake[1]: *** [CMakeFiles/cmTC_a316f.dir/build.make:78: CMakeFiles/cmTC_a316f.dir/CheckIncludeFile.c.o] Error 1
gmake[1]: Leaving directory '/home/andreagenor/code/external/llvm/build/CMakeFiles/CMakeTmp'
gmake: *** [Makefile:127: cmTC_a316f/fast] Error 2



Determining if the include file CrashReporterClient.h exists failed with the following output:
Change Dir: /home/andreagenor/code/external/llvm/build/CMakeFiles/CMakeTmp

Run Build Command(s):/usr/bin/gmake -f Makefile cmTC_bc3ad/fast && /usr/bin/gmake  -f CMakeFiles/cmTC_bc3ad.dir/build.make CMakeFiles/cmTC_bc3ad.dir/build
gmake[1]: Entering directory '/home/andreagenor/code/external/llvm/build/CMakeFiles/CMakeTmp'
Building C object CMakeFiles/cmTC_bc3ad.dir/CheckIncludeFile.c.o
/usr/bin/cc    -o CMakeFiles/cmTC_bc3ad.dir/CheckIncludeFile.c.o -c /home/andreagenor/code/external/llvm/build/CMakeFiles/CMakeTmp/CheckIncludeFile.c
/home/andreagenor/code/external/llvm/build/CMakeFiles/CMakeTmp/CheckIncludeFile.c:1:10: fatal error: CrashReporterClient.h: No such file or directory
    1 | #include <CrashReporterClient.h>
      |          ^~~~~~~~~~~~~~~~~~~~~~~
compilation terminated.
gmake[1]: *** [CMakeFiles/cmTC_bc3ad.dir/build.make:78: CMakeFiles/cmTC_bc3ad.dir/CheckIncludeFile.c.o] Error 1
gmake[1]: Leaving directory '/home/andreagenor/code/external/llvm/build/CMakeFiles/CMakeTmp'
gmake: *** [Makefile:127: cmTC_bc3ad/fast] Error 2



Determining if the function pfm_initialize exists in the pfm failed with the following output:
Change Dir: /home/andreagenor/code/external/llvm/build/CMakeFiles/CMakeTmp

Run Build Command(s):/usr/bin/gmake -f Makefile cmTC_670ae/fast && /usr/bin/gmake  -f CMakeFiles/cmTC_670ae.dir/build.make CMakeFiles/cmTC_670ae.dir/build
gmake[1]: Entering directory '/home/andreagenor/code/external/llvm/build/CMakeFiles/CMakeTmp'
Building C object CMakeFiles/cmTC_670ae.dir/CheckFunctionExists.c.o
/usr/bin/cc   -DCHECK_FUNCTION_EXISTS=pfm_initialize -o CMakeFiles/cmTC_670ae.dir/CheckFunctionExists.c.o -c /usr/local/share/cmake-3.23/Modules/CheckFunctionExists.c
Linking C executable cmTC_670ae
/usr/local/bin/cmake -E cmake_link_script CMakeFiles/cmTC_670ae.dir/link.txt --verbose=1
/usr/bin/cc  -DCHECK_FUNCTION_EXISTS=pfm_initialize CMakeFiles/cmTC_670ae.dir/CheckFunctionExists.c.o -o cmTC_670ae  -lpfm -lm 
/usr/bin/ld: cannot find -lpfm
collect2: error: ld returned 1 exit status
gmake[1]: *** [CMakeFiles/cmTC_670ae.dir/build.make:99: cmTC_670ae] Error 1
gmake[1]: Leaving directory '/home/andreagenor/code/external/llvm/build/CMakeFiles/CMakeTmp'
gmake: *** [Makefile:127: cmTC_670ae/fast] Error 2



Determining if the function xar_open exists in the xar failed with the following output:
Change Dir: /home/andreagenor/code/external/llvm/build/CMakeFiles/CMakeTmp

Run Build Command(s):/usr/bin/gmake -f Makefile cmTC_cf7af/fast && /usr/bin/gmake  -f CMakeFiles/cmTC_cf7af.dir/build.make CMakeFiles/cmTC_cf7af.dir/build
gmake[1]: Entering directory '/home/andreagenor/code/external/llvm/build/CMakeFiles/CMakeTmp'
Building C object CMakeFiles/cmTC_cf7af.dir/CheckFunctionExists.c.o
/usr/bin/cc   -DCHECK_FUNCTION_EXISTS=xar_open -o CMakeFiles/cmTC_cf7af.dir/CheckFunctionExists.c.o -c /usr/local/share/cmake-3.23/Modules/CheckFunctionExists.c
Linking C executable cmTC_cf7af
/usr/local/bin/cmake -E cmake_link_script CMakeFiles/cmTC_cf7af.dir/link.txt --verbose=1
/usr/bin/cc  -DCHECK_FUNCTION_EXISTS=xar_open CMakeFiles/cmTC_cf7af.dir/CheckFunctionExists.c.o -o cmTC_cf7af  -lxar -lm 
/usr/bin/ld: cannot find -lxar
collect2: error: ld returned 1 exit status
gmake[1]: *** [CMakeFiles/cmTC_cf7af.dir/build.make:99: cmTC_cf7af] Error 1
gmake[1]: Leaving directory '/home/andreagenor/code/external/llvm/build/CMakeFiles/CMakeTmp'
gmake: *** [Makefile:127: cmTC_cf7af/fast] Error 2



Determining if the arc4random exist failed with the following output:
Change Dir: /home/andreagenor/code/external/llvm/build/CMakeFiles/CMakeTmp

Run Build Command(s):/usr/bin/gmake -f Makefile cmTC_74d81/fast && /usr/bin/gmake  -f CMakeFiles/cmTC_74d81.dir/build.make CMakeFiles/cmTC_74d81.dir/build
gmake[1]: Entering directory '/home/andreagenor/code/external/llvm/build/CMakeFiles/CMakeTmp'
Building C object CMakeFiles/cmTC_74d81.dir/CheckSymbolExists.c.o
/usr/bin/cc    -o CMakeFiles/cmTC_74d81.dir/CheckSymbolExists.c.o -c /home/andreagenor/code/external/llvm/build/CMakeFiles/CMakeTmp/CheckSymbolExists.c
/home/andreagenor/code/external/llvm/build/CMakeFiles/CMakeTmp/CheckSymbolExists.c: In function ‘main’:
/home/andreagenor/code/external/llvm/build/CMakeFiles/CMakeTmp/CheckSymbolExists.c:8:19: error: ‘arc4random’ undeclared (first use in this function); did you mean ‘srandom’?
    8 |   return ((int*)(&arc4random))[argc];
      |                   ^~~~~~~~~~
      |                   srandom
/home/andreagenor/code/external/llvm/build/CMakeFiles/CMakeTmp/CheckSymbolExists.c:8:19: note: each undeclared identifier is reported only once for each function it appears in
gmake[1]: *** [CMakeFiles/cmTC_74d81.dir/build.make:78: CMakeFiles/cmTC_74d81.dir/CheckSymbolExists.c.o] Error 1
gmake[1]: Leaving directory '/home/andreagenor/code/external/llvm/build/CMakeFiles/CMakeTmp'
gmake: *** [Makefile:127: cmTC_74d81/fast] Error 2


File /home/andreagenor/code/external/llvm/build/CMakeFiles/CMakeTmp/CheckSymbolExists.c:
/* */
#include <stdlib.h>

int main(int argc, char** argv)
{
  (void)argv;
#ifndef arc4random
  return ((int*)(&arc4random))[argc];
#else
  (void)argc;
  return 0;
#endif
}
Performing C SOURCE FILE Test C_SUPPORTS_WERROR_UNGUARDED_AVAILABILITY_NEW failed with the following output:
Change Dir: /home/andreagenor/code/external/llvm/build/CMakeFiles/CMakeTmp

Run Build Command(s):/usr/bin/gmake -f Makefile cmTC_f824d/fast && /usr/bin/gmake  -f CMakeFiles/cmTC_f824d.dir/build.make CMakeFiles/cmTC_f824d.dir/build
gmake[1]: Entering directory '/home/andreagenor/code/external/llvm/build/CMakeFiles/CMakeTmp'
Building C object CMakeFiles/cmTC_f824d.dir/src.c.o
/usr/bin/cc -DC_SUPPORTS_WERROR_UNGUARDED_AVAILABILITY_NEW  -Werror=unguarded-availability-new -o CMakeFiles/cmTC_f824d.dir/src.c.o -c /home/andreagenor/code/external/llvm/build/CMakeFiles/CMakeTmp/src.c
cc1: error: '-Werror=unguarded-availability-new': no option '-Wunguarded-availability-new'
gmake[1]: *** [CMakeFiles/cmTC_f824d.dir/build.make:78: CMakeFiles/cmTC_f824d.dir/src.c.o] Error 1
gmake[1]: Leaving directory '/home/andreagenor/code/external/llvm/build/CMakeFiles/CMakeTmp'
gmake: *** [Makefile:127: cmTC_f824d/fast] Error 2


Source file was:
int main(void) { return 0; }
Determining if the __unw_add_dynamic_fde exist failed with the following output:
Change Dir: /home/andreagenor/code/external/llvm/build/CMakeFiles/CMakeTmp

Run Build Command(s):/usr/bin/gmake -f Makefile cmTC_1d2fc/fast && /usr/bin/gmake  -f CMakeFiles/cmTC_1d2fc.dir/build.make CMakeFiles/cmTC_1d2fc.dir/build
gmake[1]: Entering directory '/home/andreagenor/code/external/llvm/build/CMakeFiles/CMakeTmp'
Building C object CMakeFiles/cmTC_1d2fc.dir/CheckSymbolExists.c.o
/usr/bin/cc    -o CMakeFiles/cmTC_1d2fc.dir/CheckSymbolExists.c.o -c /home/andreagenor/code/external/llvm/build/CMakeFiles/CMakeTmp/CheckSymbolExists.c
Linking C executable cmTC_1d2fc
/usr/local/bin/cmake -E cmake_link_script CMakeFiles/cmTC_1d2fc.dir/link.txt --verbose=1
/usr/bin/cc CMakeFiles/cmTC_1d2fc.dir/CheckSymbolExists.c.o -o cmTC_1d2fc  -lm 
/usr/bin/ld: CMakeFiles/cmTC_1d2fc.dir/CheckSymbolExists.c.o: in function `main':
CheckSymbolExists.c:(.text+0x1f): undefined reference to `__unw_add_dynamic_fde'
collect2: error: ld returned 1 exit status
gmake[1]: *** [CMakeFiles/cmTC_1d2fc.dir/build.make:99: cmTC_1d2fc] Error 1
gmake[1]: Leaving directory '/home/andreagenor/code/external/llvm/build/CMakeFiles/CMakeTmp'
gmake: *** [Makefile:127: cmTC_1d2fc/fast] Error 2


File /home/andreagenor/code/external/llvm/build/CMakeFiles/CMakeTmp/CheckSymbolExists.c:
/* */
#include </home/andreagenor/code/external/llvm/llvm/cmake/unwind.h>

int main(int argc, char** argv)
{
  (void)argv;
#ifndef __unw_add_dynamic_fde
  return ((int*)(&__unw_add_dynamic_fde))[argc];
#else
  (void)argc;
  return 0;
#endif
}
Determining if the mallctl exist failed with the following output:
Change Dir: /home/andreagenor/code/external/llvm/build/CMakeFiles/CMakeTmp

Run Build Command(s):/usr/bin/gmake -f Makefile cmTC_56b9c/fast && /usr/bin/gmake  -f CMakeFiles/cmTC_56b9c.dir/build.make CMakeFiles/cmTC_56b9c.dir/build
gmake[1]: Entering directory '/home/andreagenor/code/external/llvm/build/CMakeFiles/CMakeTmp'
Building C object CMakeFiles/cmTC_56b9c.dir/CheckSymbolExists.c.o
/usr/bin/cc    -o CMakeFiles/cmTC_56b9c.dir/CheckSymbolExists.c.o -c /home/andreagenor/code/external/llvm/build/CMakeFiles/CMakeTmp/CheckSymbolExists.c
/home/andreagenor/code/external/llvm/build/CMakeFiles/CMakeTmp/CheckSymbolExists.c:2:10: fatal error: malloc_np.h: No such file or directory
    2 | #include <malloc_np.h>
      |          ^~~~~~~~~~~~~
compilation terminated.
gmake[1]: *** [CMakeFiles/cmTC_56b9c.dir/build.make:78: CMakeFiles/cmTC_56b9c.dir/CheckSymbolExists.c.o] Error 1
gmake[1]: Leaving directory '/home/andreagenor/code/external/llvm/build/CMakeFiles/CMakeTmp'
gmake: *** [Makefile:127: cmTC_56b9c/fast] Error 2


File /home/andreagenor/code/external/llvm/build/CMakeFiles/CMakeTmp/CheckSymbolExists.c:
/* */
#include <malloc_np.h>

int main(int argc, char** argv)
{
  (void)argv;
#ifndef mallctl
  return ((int*)(&mallctl))[argc];
#else
  (void)argc;
  return 0;
#endif
}
Determining if the malloc_zone_statistics exist failed with the following output:
Change Dir: /home/andreagenor/code/external/llvm/build/CMakeFiles/CMakeTmp

Run Build Command(s):/usr/bin/gmake -f Makefile cmTC_4d76e/fast && /usr/bin/gmake  -f CMakeFiles/cmTC_4d76e.dir/build.make CMakeFiles/cmTC_4d76e.dir/build
gmake[1]: Entering directory '/home/andreagenor/code/external/llvm/build/CMakeFiles/CMakeTmp'
Building C object CMakeFiles/cmTC_4d76e.dir/CheckSymbolExists.c.o
/usr/bin/cc    -o CMakeFiles/cmTC_4d76e.dir/CheckSymbolExists.c.o -c /home/andreagenor/code/external/llvm/build/CMakeFiles/CMakeTmp/CheckSymbolExists.c
/home/andreagenor/code/external/llvm/build/CMakeFiles/CMakeTmp/CheckSymbolExists.c:2:10: fatal error: malloc/malloc.h: No such file or directory
    2 | #include <malloc/malloc.h>
      |          ^~~~~~~~~~~~~~~~~
compilation terminated.
gmake[1]: *** [CMakeFiles/cmTC_4d76e.dir/build.make:78: CMakeFiles/cmTC_4d76e.dir/CheckSymbolExists.c.o] Error 1
gmake[1]: Leaving directory '/home/andreagenor/code/external/llvm/build/CMakeFiles/CMakeTmp'
gmake: *** [Makefile:127: cmTC_4d76e/fast] Error 2


File /home/andreagenor/code/external/llvm/build/CMakeFiles/CMakeTmp/CheckSymbolExists.c:
/* */
#include <malloc/malloc.h>

int main(int argc, char** argv)
{
  (void)argv;
#ifndef malloc_zone_statistics
  return ((int*)(&malloc_zone_statistics))[argc];
#else
  (void)argc;
  return 0;
#endif
}
Determining if the strerror_s exist failed with the following output:
Change Dir: /home/andreagenor/code/external/llvm/build/CMakeFiles/CMakeTmp

Run Build Command(s):/usr/bin/gmake -f Makefile cmTC_335f0/fast && /usr/bin/gmake  -f CMakeFiles/cmTC_335f0.dir/build.make CMakeFiles/cmTC_335f0.dir/build
gmake[1]: Entering directory '/home/andreagenor/code/external/llvm/build/CMakeFiles/CMakeTmp'
Building C object CMakeFiles/cmTC_335f0.dir/CheckSymbolExists.c.o
/usr/bin/cc    -o CMakeFiles/cmTC_335f0.dir/CheckSymbolExists.c.o -c /home/andreagenor/code/external/llvm/build/CMakeFiles/CMakeTmp/CheckSymbolExists.c
/home/andreagenor/code/external/llvm/build/CMakeFiles/CMakeTmp/CheckSymbolExists.c: In function 'main':
/home/andreagenor/code/external/llvm/build/CMakeFiles/CMakeTmp/CheckSymbolExists.c:8:19: error: 'strerror_s' undeclared (first use in this function); did you mean 'strerror_l'?
    8 |   return ((int*)(&strerror_s))[argc];
      |                   ^~~~~~~~~~
      |                   strerror_l
/home/andreagenor/code/external/llvm/build/CMakeFiles/CMakeTmp/CheckSymbolExists.c:8:19: note: each undeclared identifier is reported only once for each function it appears in
gmake[1]: *** [CMakeFiles/cmTC_335f0.dir/build.make:78: CMakeFiles/cmTC_335f0.dir/CheckSymbolExists.c.o] Error 1
gmake[1]: Leaving directory '/home/andreagenor/code/external/llvm/build/CMakeFiles/CMakeTmp'
gmake: *** [Makefile:127: cmTC_335f0/fast] Error 2


File /home/andreagenor/code/external/llvm/build/CMakeFiles/CMakeTmp/CheckSymbolExists.c:
/* */
#include <string.h>

int main(int argc, char** argv)
{
  (void)argv;
#ifndef strerror_s
  return ((int*)(&strerror_s))[argc];
#else
  (void)argc;
  return 0;
#endif
}
Determining if the dladdr exist failed with the following output:
Change Dir: /home/andreagenor/code/external/llvm/build/CMakeFiles/CMakeTmp

Run Build Command(s):/usr/bin/gmake -f Makefile cmTC_33cda/fast && /usr/bin/gmake  -f CMakeFiles/cmTC_33cda.dir/build.make CMakeFiles/cmTC_33cda.dir/build
gmake[1]: Entering directory '/home/andreagenor/code/external/llvm/build/CMakeFiles/CMakeTmp'
Building C object CMakeFiles/cmTC_33cda.dir/CheckSymbolExists.c.o
/usr/bin/cc    -o CMakeFiles/cmTC_33cda.dir/CheckSymbolExists.c.o -c /home/andreagenor/code/external/llvm/build/CMakeFiles/CMakeTmp/CheckSymbolExists.c
/home/andreagenor/code/external/llvm/build/CMakeFiles/CMakeTmp/CheckSymbolExists.c: In function 'main':
/home/andreagenor/code/external/llvm/build/CMakeFiles/CMakeTmp/CheckSymbolExists.c:8:19: error: 'dladdr' undeclared (first use in this function)
    8 |   return ((int*)(&dladdr))[argc];
      |                   ^~~~~~
/home/andreagenor/code/external/llvm/build/CMakeFiles/CMakeTmp/CheckSymbolExists.c:8:19: note: each undeclared identifier is reported only once for each function it appears in
gmake[1]: *** [CMakeFiles/cmTC_33cda.dir/build.make:78: CMakeFiles/cmTC_33cda.dir/CheckSymbolExists.c.o] Error 1
gmake[1]: Leaving directory '/home/andreagenor/code/external/llvm/build/CMakeFiles/CMakeTmp'
gmake: *** [Makefile:127: cmTC_33cda/fast] Error 2


File /home/andreagenor/code/external/llvm/build/CMakeFiles/CMakeTmp/CheckSymbolExists.c:
/* */
#include <dlfcn.h>

int main(int argc, char** argv)
{
  (void)argv;
#ifndef dladdr
  return ((int*)(&dladdr))[argc];
#else
  (void)argc;
  return 0;
#endif
}
Performing C SOURCE FILE Test HAVE_STRUCT_STAT_ST_MTIMESPEC_TV_NSEC failed with the following output:
Change Dir: /home/andreagenor/code/external/llvm/build/CMakeFiles/CMakeTmp

Run Build Command(s):/usr/bin/gmake -f Makefile cmTC_96457/fast && /usr/bin/gmake  -f CMakeFiles/cmTC_96457.dir/build.make CMakeFiles/cmTC_96457.dir/build
gmake[1]: Entering directory '/home/andreagenor/code/external/llvm/build/CMakeFiles/CMakeTmp'
Building C object CMakeFiles/cmTC_96457.dir/src.c.o
/usr/bin/cc -DHAVE_STRUCT_STAT_ST_MTIMESPEC_TV_NSEC   -o CMakeFiles/cmTC_96457.dir/src.c.o -c /home/andreagenor/code/external/llvm/build/CMakeFiles/CMakeTmp/src.c
/home/andreagenor/code/external/llvm/build/CMakeFiles/CMakeTmp/src.c: In function 'main':
/home/andreagenor/code/external/llvm/build/CMakeFiles/CMakeTmp/src.c:7:34: error: 'struct stat' has no member named 'st_mtimespec'
    7 |   (void)sizeof(((struct stat *)0)->st_mtimespec.tv_nsec);
      |                                  ^~
gmake[1]: *** [CMakeFiles/cmTC_96457.dir/build.make:78: CMakeFiles/cmTC_96457.dir/src.c.o] Error 1
gmake[1]: Leaving directory '/home/andreagenor/code/external/llvm/build/CMakeFiles/CMakeTmp'
gmake: *** [Makefile:127: cmTC_96457/fast] Error 2


Source file was:

#include <sys/types.h>
#include <sys/stat.h>

int main()
{
  (void)sizeof(((struct stat *)0)->st_mtimespec.tv_nsec);
  return 0;
}

Determining if the proc_pid_rusage exist failed with the following output:
Change Dir: /home/andreagenor/code/external/llvm/build/CMakeFiles/CMakeTmp

Run Build Command(s):/usr/bin/gmake -f Makefile cmTC_1cc24/fast && /usr/bin/gmake  -f CMakeFiles/cmTC_1cc24.dir/build.make CMakeFiles/cmTC_1cc24.dir/build
gmake[1]: Entering directory '/home/andreagenor/code/external/llvm/build/CMakeFiles/CMakeTmp'
Building C object CMakeFiles/cmTC_1cc24.dir/CheckSymbolExists.c.o
/usr/bin/cc -D_GNU_SOURCE   -o CMakeFiles/cmTC_1cc24.dir/CheckSymbolExists.c.o -c /home/andreagenor/code/external/llvm/build/CMakeFiles/CMakeTmp/CheckSymbolExists.c
/home/andreagenor/code/external/llvm/build/CMakeFiles/CMakeTmp/CheckSymbolExists.c:2:10: fatal error: libproc.h: No such file or directory
    2 | #include <libproc.h>
      |          ^~~~~~~~~~~
compilation terminated.
gmake[1]: *** [CMakeFiles/cmTC_1cc24.dir/build.make:78: CMakeFiles/cmTC_1cc24.dir/CheckSymbolExists.c.o] Error 1
gmake[1]: Leaving directory '/home/andreagenor/code/external/llvm/build/CMakeFiles/CMakeTmp'
gmake: *** [Makefile:127: cmTC_1cc24/fast] Error 2


File /home/andreagenor/code/external/llvm/build/CMakeFiles/CMakeTmp/CheckSymbolExists.c:
/* */
#include <libproc.h>

int main(int argc, char** argv)
{
  (void)argv;
#ifndef proc_pid_rusage
  return ((int*)(&proc_pid_rusage))[argc];
#else
  (void)argc;
  return 0;
#endif
}
Performing C++ SOURCE FILE Test SUPPORTS_GNU_ZERO_VARIADIC_MACRO_ARGUMENTS_FLAG failed with the following output:
Change Dir: /home/andreagenor/code/external/llvm/build/CMakeFiles/CMakeTmp

Run Build Command(s):/usr/bin/gmake -f Makefile cmTC_19d08/fast && /usr/bin/gmake  -f CMakeFiles/cmTC_19d08.dir/build.make CMakeFiles/cmTC_19d08.dir/build
gmake[1]: Entering directory '/home/andreagenor/code/external/llvm/build/CMakeFiles/CMakeTmp'
Building CXX object CMakeFiles/cmTC_19d08.dir/src.cxx.o
/usr/bin/c++ -DSUPPORTS_GNU_ZERO_VARIADIC_MACRO_ARGUMENTS_FLAG  -Wgnu-zero-variadic-macro-arguments -std=c++14 -o CMakeFiles/cmTC_19d08.dir/src.cxx.o -c /home/andreagenor/code/external/llvm/build/CMakeFiles/CMakeTmp/src.cxx
c++: error: unrecognized command-line option '-Wgnu-zero-variadic-macro-arguments'
gmake[1]: *** [CMakeFiles/cmTC_19d08.dir/build.make:78: CMakeFiles/cmTC_19d08.dir/src.cxx.o] Error 1
gmake[1]: Leaving directory '/home/andreagenor/code/external/llvm/build/CMakeFiles/CMakeTmp'
gmake: *** [Makefile:127: cmTC_19d08/fast] Error 2


Source file was:
int main() { return 0; }
Performing C++ SOURCE FILE Test CXX_SUPPORTS_WERROR_UNGUARDED_AVAILABILITY_NEW failed with the following output:
Change Dir: /home/andreagenor/code/external/llvm/build/CMakeFiles/CMakeTmp

Run Build Command(s):/usr/bin/gmake -f Makefile cmTC_23d3b/fast && /usr/bin/gmake  -f CMakeFiles/cmTC_23d3b.dir/build.make CMakeFiles/cmTC_23d3b.dir/build
gmake[1]: Entering directory '/home/andreagenor/code/external/llvm/build/CMakeFiles/CMakeTmp'
Building CXX object CMakeFiles/cmTC_23d3b.dir/src.cxx.o
/usr/bin/c++ -DCXX_SUPPORTS_WERROR_UNGUARDED_AVAILABILITY_NEW  -fPIC -fno-semantic-interposition -fvisibility-inlines-hidden -Werror=date-time    -Werror -Werror=unguarded-availability-new -std=c++14 -o CMakeFiles/cmTC_23d3b.dir/src.cxx.o -c /home/andreagenor/code/external/llvm/build/CMakeFiles/CMakeTmp/src.cxx
cc1plus: error: '-Werror=unguarded-availability-new': no option '-Wunguarded-availability-new'
gmake[1]: *** [CMakeFiles/cmTC_23d3b.dir/build.make:78: CMakeFiles/cmTC_23d3b.dir/src.cxx.o] Error 1
gmake[1]: Leaving directory '/home/andreagenor/code/external/llvm/build/CMakeFiles/CMakeTmp'
gmake: *** [Makefile:127: cmTC_23d3b/fast] Error 2


Source file was:
int main() { return 0; }
Performing C SOURCE FILE Test C_SUPPORTS_CXX98_COMPAT_EXTRA_SEMI_FLAG failed with the following output:
Change Dir: /home/andreagenor/code/external/llvm/build/CMakeFiles/CMakeTmp

Run Build Command(s):/usr/bin/gmake -f Makefile cmTC_ec302/fast && /usr/bin/gmake  -f CMakeFiles/cmTC_ec302.dir/build.make CMakeFiles/cmTC_ec302.dir/build
gmake[1]: Entering directory '/home/andreagenor/code/external/llvm/build/CMakeFiles/CMakeTmp'
Building C object CMakeFiles/cmTC_ec302.dir/src.c.o
/usr/bin/cc -DC_SUPPORTS_CXX98_COMPAT_EXTRA_SEMI_FLAG  -fPIC -fno-semantic-interposition -Werror=date-time -Wall -Wextra -Wno-unused-parameter -Wwrite-strings -Wno-missing-field-initializers -pedantic -Wno-long-long    -Werror -Wc++98-compat-extra-semi -o CMakeFiles/cmTC_ec302.dir/src.c.o -c /home/andreagenor/code/external/llvm/build/CMakeFiles/CMakeTmp/src.c
cc: error: unrecognized command-line option '-Wc++98-compat-extra-semi'
gmake[1]: *** [CMakeFiles/cmTC_ec302.dir/build.make:78: CMakeFiles/cmTC_ec302.dir/src.c.o] Error 1
gmake[1]: Leaving directory '/home/andreagenor/code/external/llvm/build/CMakeFiles/CMakeTmp'
gmake: *** [Makefile:127: cmTC_ec302/fast] Error 2


Source file was:
int main(void) { return 0; }
Performing C++ SOURCE FILE Test CXX_SUPPORTS_CXX98_COMPAT_EXTRA_SEMI_FLAG failed with the following output:
Change Dir: /home/andreagenor/code/external/llvm/build/CMakeFiles/CMakeTmp

Run Build Command(s):/usr/bin/gmake -f Makefile cmTC_293e4/fast && /usr/bin/gmake  -f CMakeFiles/cmTC_293e4.dir/build.make CMakeFiles/cmTC_293e4.dir/build
gmake[1]: Entering directory '/home/andreagenor/code/external/llvm/build/CMakeFiles/CMakeTmp'
Building CXX object CMakeFiles/cmTC_293e4.dir/src.cxx.o
/usr/bin/c++ -DCXX_SUPPORTS_CXX98_COMPAT_EXTRA_SEMI_FLAG  -fPIC -fno-semantic-interposition -fvisibility-inlines-hidden -Werror=date-time -Wall -Wextra -Wno-unused-parameter -Wwrite-strings -Wcast-qual -Wno-missing-field-initializers -pedantic -Wno-long-long    -Werror -Wc++98-compat-extra-semi -std=c++14 -o CMakeFiles/cmTC_293e4.dir/src.cxx.o -c /home/andreagenor/code/external/llvm/build/CMakeFiles/CMakeTmp/src.cxx
c++: error: unrecognized command-line option '-Wc++98-compat-extra-semi'
gmake[1]: *** [CMakeFiles/cmTC_293e4.dir/build.make:78: CMakeFiles/cmTC_293e4.dir/src.cxx.o] Error 1
gmake[1]: Leaving directory '/home/andreagenor/code/external/llvm/build/CMakeFiles/CMakeTmp'
gmake: *** [Makefile:127: cmTC_293e4/fast] Error 2


Source file was:
int main() { return 0; }
Performing C SOURCE FILE Test C_SUPPORTS_COVERED_SWITCH_DEFAULT_FLAG failed with the following output:
Change Dir: /home/andreagenor/code/external/llvm/build/CMakeFiles/CMakeTmp

Run Build Command(s):/usr/bin/gmake -f Makefile cmTC_c2262/fast && /usr/bin/gmake  -f CMakeFiles/cmTC_c2262.dir/build.make CMakeFiles/cmTC_c2262.dir/build
gmake[1]: Entering directory '/home/andreagenor/code/external/llvm/build/CMakeFiles/CMakeTmp'
Building C object CMakeFiles/cmTC_c2262.dir/src.c.o
/usr/bin/cc -DC_SUPPORTS_COVERED_SWITCH_DEFAULT_FLAG  -fPIC -fno-semantic-interposition -Werror=date-time -Wall -Wextra -Wno-unused-parameter -Wwrite-strings -Wno-missing-field-initializers -pedantic -Wno-long-long -Wimplicit-fallthrough    -Werror -Wcovered-switch-default -o CMakeFiles/cmTC_c2262.dir/src.c.o -c /home/andreagenor/code/external/llvm/build/CMakeFiles/CMakeTmp/src.c
cc: error: unrecognized command-line option '-Wcovered-switch-default'; did you mean '-Wno-switch-default'?
gmake[1]: *** [CMakeFiles/cmTC_c2262.dir/build.make:78: CMakeFiles/cmTC_c2262.dir/src.c.o] Error 1
gmake[1]: Leaving directory '/home/andreagenor/code/external/llvm/build/CMakeFiles/CMakeTmp'
gmake: *** [Makefile:127: cmTC_c2262/fast] Error 2


Source file was:
int main(void) { return 0; }
Performing C++ SOURCE FILE Test CXX_SUPPORTS_COVERED_SWITCH_DEFAULT_FLAG failed with the following output:
Change Dir: /home/andreagenor/code/external/llvm/build/CMakeFiles/CMakeTmp

Run Build Command(s):/usr/bin/gmake -f Makefile cmTC_2c999/fast && /usr/bin/gmake  -f CMakeFiles/cmTC_2c999.dir/build.make CMakeFiles/cmTC_2c999.dir/build
gmake[1]: Entering directory '/home/andreagenor/code/external/llvm/build/CMakeFiles/CMakeTmp'
Building CXX object CMakeFiles/cmTC_2c999.dir/src.cxx.o
/usr/bin/c++ -DCXX_SUPPORTS_COVERED_SWITCH_DEFAULT_FLAG  -fPIC -fno-semantic-interposition -fvisibility-inlines-hidden -Werror=date-time -Wall -Wextra -Wno-unused-parameter -Wwrite-strings -Wcast-qual -Wno-missing-field-initializers -pedantic -Wno-long-long -Wimplicit-fallthrough    -Werror -Wcovered-switch-default -std=c++14 -o CMakeFiles/cmTC_2c999.dir/src.cxx.o -c /home/andreagenor/code/external/llvm/build/CMakeFiles/CMakeTmp/src.cxx
c++: error: unrecognized command-line option '-Wcovered-switch-default'; did you mean '-Wno-switch-default'?
gmake[1]: *** [CMakeFiles/cmTC_2c999.dir/build.make:78: CMakeFiles/cmTC_2c999.dir/src.cxx.o] Error 1
gmake[1]: Leaving directory '/home/andreagenor/code/external/llvm/build/CMakeFiles/CMakeTmp'
gmake: *** [Makefile:127: cmTC_2c999/fast] Error 2


Source file was:
int main() { return 0; }
Performing C++ SOURCE FILE Test CXX_WONT_WARN_ON_FINAL_NONVIRTUALDTOR failed with the following output:
Change Dir: /home/andreagenor/code/external/llvm/build/CMakeFiles/CMakeTmp

Run Build Command(s):/usr/bin/gmake -f Makefile cmTC_cccca/fast && /usr/bin/gmake  -f CMakeFiles/cmTC_cccca.dir/build.make CMakeFiles/cmTC_cccca.dir/build
gmake[1]: Entering directory '/home/andreagenor/code/external/llvm/build/CMakeFiles/CMakeTmp'
Building CXX object CMakeFiles/cmTC_cccca.dir/src.cxx.o
/usr/bin/c++ -DCXX_WONT_WARN_ON_FINAL_NONVIRTUALDTOR -D_GNU_SOURCE  -fPIC -fno-semantic-interposition -fvisibility-inlines-hidden -Werror=date-time -Wall -Wextra -Wno-unused-parameter -Wwrite-strings -Wcast-qual -Wno-missing-field-initializers -pedantic -Wno-long-long -Wimplicit-fallthrough -Wno-maybe-uninitialized -Wno-class-memaccess -Wno-redundant-move -Wno-pessimizing-move -Wno-noexcept-type  -Werror=non-virtual-dtor -std=c++14 -o CMakeFiles/cmTC_cccca.dir/src.cxx.o -c /home/andreagenor/code/external/llvm/build/CMakeFiles/CMakeTmp/src.cxx
/home/andreagenor/code/external/llvm/build/CMakeFiles/CMakeTmp/src.cxx:2:36: error: 'class base' has virtual functions and accessible non-virtual destructor [-Werror=non-virtual-dtor]
    2 |                              class base {friend f; public: virtual void anchor();protected: ~base();};
      |                                    ^~~~
cc1plus: some warnings being treated as errors
gmake[1]: *** [CMakeFiles/cmTC_cccca.dir/build.make:78: CMakeFiles/cmTC_cccca.dir/src.cxx.o] Error 1
gmake[1]: Leaving directory '/home/andreagenor/code/external/llvm/build/CMakeFiles/CMakeTmp'
gmake: *** [Makefile:127: cmTC_cccca/fast] Error 2


Source file was:
class f {};
                             class base {friend f; public: virtual void anchor();protected: ~base();};
                             int main() { return 0; }
Performing C SOURCE FILE Test C_WCOMMENT_ALLOWS_LINE_WRAP failed with the following output:
Change Dir: /home/andreagenor/code/external/llvm/build/CMakeFiles/CMakeTmp

Run Build Command(s):/usr/bin/gmake -f Makefile cmTC_d6c5c/fast && /usr/bin/gmake  -f CMakeFiles/cmTC_d6c5c.dir/build.make CMakeFiles/cmTC_d6c5c.dir/build
gmake[1]: Entering directory '/home/andreagenor/code/external/llvm/build/CMakeFiles/CMakeTmp'
Building C object CMakeFiles/cmTC_d6c5c.dir/src.c.o
/usr/bin/cc -DC_WCOMMENT_ALLOWS_LINE_WRAP -D_GNU_SOURCE  -fPIC -fno-semantic-interposition -Werror=date-time -Wall -Wextra -Wno-unused-parameter -Wwrite-strings -Wno-missing-field-initializers -pedantic -Wno-long-long -Wimplicit-fallthrough  -Werror -Wcomment -o CMakeFiles/cmTC_d6c5c.dir/src.c.o -c /home/andreagenor/code/external/llvm/build/CMakeFiles/CMakeTmp/src.c
/home/andreagenor/code/external/llvm/build/CMakeFiles/CMakeTmp/src.c:1:1: error: multi-line comment [-Werror=comment]
    1 | // \
      | ^
cc1: all warnings being treated as errors
gmake[1]: *** [CMakeFiles/cmTC_d6c5c.dir/build.make:78: CMakeFiles/cmTC_d6c5c.dir/src.c.o] Error 1
gmake[1]: Leaving directory '/home/andreagenor/code/external/llvm/build/CMakeFiles/CMakeTmp'
gmake: *** [Makefile:127: cmTC_d6c5c/fast] Error 2


Source file was:
// \
//
int main() {return 0;}
Performing C SOURCE FILE Test C_SUPPORTS_STRING_CONVERSION_FLAG failed with the following output:
Change Dir: /home/andreagenor/code/external/llvm/build/CMakeFiles/CMakeTmp

Run Build Command(s):/usr/bin/gmake -f Makefile cmTC_d8095/fast && /usr/bin/gmake  -f CMakeFiles/cmTC_d8095.dir/build.make CMakeFiles/cmTC_d8095.dir/build
gmake[1]: Entering directory '/home/andreagenor/code/external/llvm/build/CMakeFiles/CMakeTmp'
Building C object CMakeFiles/cmTC_d8095.dir/src.c.o
/usr/bin/cc -DC_SUPPORTS_STRING_CONVERSION_FLAG  -fPIC -fno-semantic-interposition -Werror=date-time -Wall -Wextra -Wno-unused-parameter -Wwrite-strings -Wno-missing-field-initializers -pedantic -Wno-long-long -Wimplicit-fallthrough -Wno-comment    -Werror -Wstring-conversion -o CMakeFiles/cmTC_d8095.dir/src.c.o -c /home/andreagenor/code/external/llvm/build/CMakeFiles/CMakeTmp/src.c
cc: error: unrecognized command-line option '-Wstring-conversion'; did you mean '-Wsign-conversion'?
gmake[1]: *** [CMakeFiles/cmTC_d8095.dir/build.make:78: CMakeFiles/cmTC_d8095.dir/src.c.o] Error 1
gmake[1]: Leaving directory '/home/andreagenor/code/external/llvm/build/CMakeFiles/CMakeTmp'
gmake: *** [Makefile:127: cmTC_d8095/fast] Error 2


Source file was:
int main(void) { return 0; }
Performing C++ SOURCE FILE Test CXX_SUPPORTS_STRING_CONVERSION_FLAG failed with the following output:
Change Dir: /home/andreagenor/code/external/llvm/build/CMakeFiles/CMakeTmp

Run Build Command(s):/usr/bin/gmake -f Makefile cmTC_9e60c/fast && /usr/bin/gmake  -f CMakeFiles/cmTC_9e60c.dir/build.make CMakeFiles/cmTC_9e60c.dir/build
gmake[1]: Entering directory '/home/andreagenor/code/external/llvm/build/CMakeFiles/CMakeTmp'
Building CXX object CMakeFiles/cmTC_9e60c.dir/src.cxx.o
/usr/bin/c++ -DCXX_SUPPORTS_STRING_CONVERSION_FLAG  -fPIC -fno-semantic-interposition -fvisibility-inlines-hidden -Werror=date-time -Wall -Wextra -Wno-unused-parameter -Wwrite-strings -Wcast-qual -Wno-missing-field-initializers -pedantic -Wno-long-long -Wimplicit-fallthrough -Wno-maybe-uninitialized -Wno-class-memaccess -Wno-redundant-move -Wno-pessimizing-move -Wno-noexcept-type -Wdelete-non-virtual-dtor -Wsuggest-override -Wno-comment    -Werror -Wstring-conversion -std=c++14 -o CMakeFiles/cmTC_9e60c.dir/src.cxx.o -c /home/andreagenor/code/external/llvm/build/CMakeFiles/CMakeTmp/src.cxx
c++: error: unrecognized command-line option '-Wstring-conversion'; did you mean '-Wsign-conversion'?
gmake[1]: *** [CMakeFiles/cmTC_9e60c.dir/build.make:78: CMakeFiles/cmTC_9e60c.dir/src.cxx.o] Error 1
gmake[1]: Leaving directory '/home/andreagenor/code/external/llvm/build/CMakeFiles/CMakeTmp'
gmake: *** [Makefile:127: cmTC_9e60c/fast] Error 2


Source file was:
int main() { return 0; }
Determining if the os_signpost_interval_begin exist failed with the following output:
Change Dir: /home/andreagenor/code/external/llvm/build/CMakeFiles/CMakeTmp

Run Build Command(s):/usr/bin/gmake -f Makefile cmTC_4d939/fast && /usr/bin/gmake  -f CMakeFiles/cmTC_4d939.dir/build.make CMakeFiles/cmTC_4d939.dir/build
gmake[1]: Entering directory '/home/andreagenor/code/external/llvm/build/CMakeFiles/CMakeTmp'
Building C object CMakeFiles/cmTC_4d939.dir/CheckSymbolExists.c.o
/usr/bin/cc -D_GNU_SOURCE  -fPIC -fno-semantic-interposition -Wall -Wextra -Wno-unused-parameter -Wwrite-strings -Wno-missing-field-initializers -pedantic -Wno-long-long -Wimplicit-fallthrough -Wno-comment -Wmisleading-indentation -ffunction-sections -fdata-sections  -o CMakeFiles/cmTC_4d939.dir/CheckSymbolExists.c.o -c /home/andreagenor/code/external/llvm/build/CMakeFiles/CMakeTmp/CheckSymbolExists.c
/home/andreagenor/code/external/llvm/build/CMakeFiles/CMakeTmp/CheckSymbolExists.c:2:10: fatal error: os/signpost.h: No such file or directory
    2 | #include <os/signpost.h>
      |          ^~~~~~~~~~~~~~~
compilation terminated.
gmake[1]: *** [CMakeFiles/cmTC_4d939.dir/build.make:78: CMakeFiles/cmTC_4d939.dir/CheckSymbolExists.c.o] Error 1
gmake[1]: Leaving directory '/home/andreagenor/code/external/llvm/build/CMakeFiles/CMakeTmp'
gmake: *** [Makefile:127: cmTC_4d939/fast] Error 2


File /home/andreagenor/code/external/llvm/build/CMakeFiles/CMakeTmp/CheckSymbolExists.c:
/* */
#include <os/signpost.h>

int main(int argc, char** argv)
{
  (void)argv;
#ifndef os_signpost_interval_begin
  return ((int*)(&os_signpost_interval_begin))[argc];
#else
  (void)argc;
  return 0;
#endif
}
Performing C++ SOURCE FILE Test HAS_WERROR_GLOBAL_CTORS failed with the following output:
Change Dir: /home/andreagenor/code/external/llvm/build/CMakeFiles/CMakeTmp

Run Build Command(s):/usr/bin/gmake -f Makefile cmTC_cf872/fast && /usr/bin/gmake  -f CMakeFiles/cmTC_cf872.dir/build.make CMakeFiles/cmTC_cf872.dir/build
gmake[1]: Entering directory '/home/andreagenor/code/external/llvm/build/CMakeFiles/CMakeTmp'
Building CXX object CMakeFiles/cmTC_cf872.dir/src.cxx.o
/usr/bin/c++ -DHAS_WERROR_GLOBAL_CTORS  -fPIC -fno-semantic-interposition -fvisibility-inlines-hidden -Werror=date-time -Wall -Wextra -Wno-unused-parameter -Wwrite-strings -Wcast-qual -Wno-missing-field-initializers -pedantic -Wno-long-long -Wimplicit-fallthrough -Wno-maybe-uninitialized -Wno-class-memaccess -Wno-redundant-move -Wno-pessimizing-move -Wno-noexcept-type -Wdelete-non-virtual-dtor -Wsuggest-override -Wno-comment -Wmisleading-indentation -ffunction-sections -fdata-sections    -Werror=global-constructors -std=c++14 -o CMakeFiles/cmTC_cf872.dir/src.cxx.o -c /home/andreagenor/code/external/llvm/build/CMakeFiles/CMakeTmp/src.cxx
cc1plus: error: '-Werror=global-constructors': no option '-Wglobal-constructors'; did you mean '-felide-constructors'?
gmake[1]: *** [CMakeFiles/cmTC_cf872.dir/build.make:78: CMakeFiles/cmTC_cf872.dir/src.cxx.o] Error 1
gmake[1]: Leaving directory '/home/andreagenor/code/external/llvm/build/CMakeFiles/CMakeTmp'
gmake: *** [Makefile:127: cmTC_cf872/fast] Error 2


Source file was:
int main() { return 0; }
Performing C++ SOURCE FILE Test CXX_SUPPORTS_NO_NESTED_ANON_TYPES_FLAG failed with the following output:
Change Dir: /home/andreagenor/code/external/llvm/build/CMakeFiles/CMakeTmp

Run Build Command(s):/usr/bin/gmake -f Makefile cmTC_05c9d/fast && /usr/bin/gmake  -f CMakeFiles/cmTC_05c9d.dir/build.make CMakeFiles/cmTC_05c9d.dir/build
gmake[1]: Entering directory '/home/andreagenor/code/external/llvm/build/CMakeFiles/CMakeTmp'
Building CXX object CMakeFiles/cmTC_05c9d.dir/src.cxx.o
/usr/bin/c++ -DCXX_SUPPORTS_NO_NESTED_ANON_TYPES_FLAG  -fPIC -fno-semantic-interposition -fvisibility-inlines-hidden -Werror=date-time -Wall -Wextra -Wno-unused-parameter -Wwrite-strings -Wcast-qual -Wno-missing-field-initializers -pedantic -Wno-long-long -Wimplicit-fallthrough -Wno-maybe-uninitialized -Wno-class-memaccess -Wno-redundant-move -Wno-pessimizing-move -Wno-noexcept-type -Wdelete-non-virtual-dtor -Wsuggest-override -Wno-comment -Wmisleading-indentation -ffunction-sections -fdata-sections -fno-common -Woverloaded-virtual -fno-strict-aliasing    -Werror -Wnested-anon-types -std=c++14 -o CMakeFiles/cmTC_05c9d.dir/src.cxx.o -c /home/andreagenor/code/external/llvm/build/CMakeFiles/CMakeTmp/src.cxx
c++: error: unrecognized command-line option '-Wnested-anon-types'
gmake[1]: *** [CMakeFiles/cmTC_05c9d.dir/build.make:78: CMakeFiles/cmTC_05c9d.dir/src.cxx.o] Error 1
gmake[1]: Leaving directory '/home/andreagenor/code/external/llvm/build/CMakeFiles/CMakeTmp'
gmake: *** [Makefile:127: cmTC_05c9d/fast] Error 2


Source file was:
int main() { return 0; }
Determining if the function __secure_getenv exists failed with the following output:
Change Dir: /home/andreagenor/code/external/llvm/build/CMakeFiles/CMakeTmp

Run Build Command(s):/usr/bin/gmake -f Makefile cmTC_0c69f/fast && /usr/bin/gmake  -f CMakeFiles/cmTC_0c69f.dir/build.make CMakeFiles/cmTC_0c69f.dir/build
gmake[1]: Entering directory '/home/andreagenor/code/external/llvm/build/CMakeFiles/CMakeTmp'
Building C object CMakeFiles/cmTC_0c69f.dir/CheckFunctionExists.c.o
/usr/bin/cc -D_GNU_SOURCE  -fPIC -fno-semantic-interposition -Werror=date-time -Wall -Wextra -Wno-unused-parameter -Wwrite-strings -Wno-missing-field-initializers -pedantic -Wno-long-long -Wimplicit-fallthrough -Wno-comment -Wmisleading-indentation -ffunction-sections -fdata-sections -DCHECK_FUNCTION_EXISTS=__secure_getenv -std=gnu99 -o CMakeFiles/cmTC_0c69f.dir/CheckFunctionExists.c.o -c /usr/local/share/cmake-3.23/Modules/CheckFunctionExists.c
Linking C executable cmTC_0c69f
/usr/local/bin/cmake -E cmake_link_script CMakeFiles/cmTC_0c69f.dir/link.txt --verbose=1
/usr/bin/cc  -fPIC -fno-semantic-interposition -Werror=date-time -Wall -Wextra -Wno-unused-parameter -Wwrite-strings -Wno-missing-field-initializers -pedantic -Wno-long-long -Wimplicit-fallthrough -Wno-comment -Wmisleading-indentation -ffunction-sections -fdata-sections -DCHECK_FUNCTION_EXISTS=__secure_getenv CMakeFiles/cmTC_0c69f.dir/CheckFunctionExists.c.o -o cmTC_0c69f  -lm 
/usr/bin/ld: CMakeFiles/cmTC_0c69f.dir/CheckFunctionExists.c.o: in function `main':
CheckFunctionExists.c:(.text.main+0x14): undefined reference to `__secure_getenv'
collect2: error: ld returned 1 exit status
gmake[1]: *** [CMakeFiles/cmTC_0c69f.dir/build.make:99: cmTC_0c69f] Error 1
gmake[1]: Leaving directory '/home/andreagenor/code/external/llvm/build/CMakeFiles/CMakeTmp'
gmake: *** [Makefile:127: cmTC_0c69f/fast] Error 2



Performing C++ SOURCE FILE Test HAS_INST_AFTER_SPEC failed with the following output:
Change Dir: /home/andreagenor/code/external/llvm/build/CMakeFiles/CMakeTmp

Run Build Command(s):/usr/bin/gmake -f Makefile cmTC_c1b1d/fast && /usr/bin/gmake  -f CMakeFiles/cmTC_c1b1d.dir/build.make CMakeFiles/cmTC_c1b1d.dir/build
gmake[1]: Entering directory '/home/andreagenor/code/external/llvm/build/CMakeFiles/CMakeTmp'
Building CXX object CMakeFiles/cmTC_c1b1d.dir/src.cxx.o
/usr/bin/c++ -DHAS_INST_AFTER_SPEC  -fPIC -fno-semantic-interposition -fvisibility-inlines-hidden -Werror=date-time -Wall -Wextra -Wno-unused-parameter -Wwrite-strings -Wcast-qual -Wno-missing-field-initializers -pedantic -Wno-long-long -Wimplicit-fallthrough -Wno-maybe-uninitialized -Wno-class-memaccess -Wno-redundant-move -Wno-pessimizing-move -Wno-noexcept-type -Wdelete-non-virtual-dtor -Wsuggest-override -Wno-comment -Wmisleading-indentation -ffunction-sections -fdata-sections -Wall -Wextra -Wno-deprecated-declarations -Werror    -Winstantiation-after-specialization -std=c++17 -o CMakeFiles/cmTC_c1b1d.dir/src.cxx.o -c /home/andreagenor/code/external/llvm/build/CMakeFiles/CMakeTmp/src.cxx
c++: error: unrecognized command-line option '-Winstantiation-after-specialization'
gmake[1]: *** [CMakeFiles/cmTC_c1b1d.dir/build.make:78: CMakeFiles/cmTC_c1b1d.dir/src.cxx.o] Error 1
gmake[1]: Leaving directory '/home/andreagenor/code/external/llvm/build/CMakeFiles/CMakeTmp'
gmake: *** [Makefile:127: cmTC_c1b1d/fast] Error 2


Source file was:
int main() { return 0; }
Performing C++ SOURCE FILE Test SYCL_CXX_SUPPORTS_INCONSISTENT_MISSING_OVERRIDE_FLAG failed with the following output:
Change Dir: /home/andreagenor/code/external/llvm/build/CMakeFiles/CMakeTmp

Run Build Command(s):/usr/bin/gmake -f Makefile cmTC_fdeec/fast && /usr/bin/gmake  -f CMakeFiles/cmTC_fdeec.dir/build.make CMakeFiles/cmTC_fdeec.dir/build
gmake[1]: Entering directory '/home/andreagenor/code/external/llvm/build/CMakeFiles/CMakeTmp'
Building CXX object CMakeFiles/cmTC_fdeec.dir/src.cxx.o
/usr/bin/c++ -DSYCL_CXX_SUPPORTS_INCONSISTENT_MISSING_OVERRIDE_FLAG  -fPIC -fno-semantic-interposition -fvisibility-inlines-hidden -Werror=date-time -Wall -Wextra -Wno-unused-parameter -Wwrite-strings -Wcast-qual -Wno-missing-field-initializers -pedantic -Wno-long-long -Wimplicit-fallthrough -Wno-maybe-uninitialized -Wno-class-memaccess -Wno-redundant-move -Wno-pessimizing-move -Wno-noexcept-type -Wdelete-non-virtual-dtor -Wsuggest-override -Wno-comment -Wmisleading-indentation -ffunction-sections -fdata-sections -Wall -Wextra -Wno-deprecated-declarations -Werror    -Winconsistent-missing-override -std=c++17 -o CMakeFiles/cmTC_fdeec.dir/src.cxx.o -c /home/andreagenor/code/external/llvm/build/CMakeFiles/CMakeTmp/src.cxx
c++: error: unrecognized command-line option '-Winconsistent-missing-override'
gmake[1]: *** [CMakeFiles/cmTC_fdeec.dir/build.make:78: CMakeFiles/cmTC_fdeec.dir/src.cxx.o] Error 1
gmake[1]: Leaving directory '/home/andreagenor/code/external/llvm/build/CMakeFiles/CMakeTmp'
gmake: *** [Makefile:127: cmTC_fdeec/fast] Error 2


Source file was:
int main() { return 0; }
Performing C++ SOURCE FILE Test HAVE_CXX_FLAG_WSHORTEN_64_TO_32 failed with the following output:
Change Dir: /home/andreagenor/code/external/llvm/build/CMakeFiles/CMakeTmp

Run Build Command(s):/usr/bin/gmake -f Makefile cmTC_30036/fast && /usr/bin/gmake  -f CMakeFiles/cmTC_30036.dir/build.make CMakeFiles/cmTC_30036.dir/build
gmake[1]: Entering directory '/home/andreagenor/code/external/llvm/build/CMakeFiles/CMakeTmp'
Building CXX object CMakeFiles/cmTC_30036.dir/src.cxx.o
/usr/bin/c++ -DHAVE_CXX_FLAG_WSHORTEN_64_TO_32  -fPIC -fno-semantic-interposition -fvisibility-inlines-hidden -Werror=date-time -Wall -Wextra -Wno-unused-parameter -Wwrite-strings -Wcast-qual -Wno-missing-field-initializers -pedantic -Wno-long-long -Wimplicit-fallthrough -Wno-maybe-uninitialized -Wno-class-memaccess -Wno-redundant-move -Wno-pessimizing-move -Wno-noexcept-type -Wdelete-non-virtual-dtor -Wsuggest-override -Wno-comment -Wmisleading-indentation -ffunction-sections -fdata-sections  -std=c++11  -Wall  -Wextra  -Wshadow  -Wsuggest-override  -pedantic  -pedantic-errors  -Wshorten-64-to-32   -Wshorten-64-to-32 -std=c++14 -o CMakeFiles/cmTC_30036.dir/src.cxx.o -c /home/andreagenor/code/external/llvm/build/CMakeFiles/CMakeTmp/src.cxx
c++: error: unrecognized command-line option '-Wshorten-64-to-32'
c++: error: unrecognized command-line option '-Wshorten-64-to-32'
gmake[1]: *** [CMakeFiles/cmTC_30036.dir/build.make:78: CMakeFiles/cmTC_30036.dir/src.cxx.o] Error 1
gmake[1]: Leaving directory '/home/andreagenor/code/external/llvm/build/CMakeFiles/CMakeTmp'
gmake: *** [Makefile:127: cmTC_30036/fast] Error 2


Source file was:
int main() { return 0; }
Performing C++ SOURCE FILE Test HAVE_CXX_FLAG_WD654 failed with the following output:
Change Dir: /home/andreagenor/code/external/llvm/build/CMakeFiles/CMakeTmp

Run Build Command(s):/usr/bin/gmake -f Makefile cmTC_abb79/fast && /usr/bin/gmake  -f CMakeFiles/cmTC_abb79.dir/build.make CMakeFiles/cmTC_abb79.dir/build
gmake[1]: Entering directory '/home/andreagenor/code/external/llvm/build/CMakeFiles/CMakeTmp'
Building CXX object CMakeFiles/cmTC_abb79.dir/src.cxx.o
/usr/bin/c++ -DHAVE_CXX_FLAG_WD654  -fPIC -fno-semantic-interposition -fvisibility-inlines-hidden -Werror=date-time -Wall -Wextra -Wno-unused-parameter -Wwrite-strings -Wcast-qual -Wno-missing-field-initializers -pedantic -Wno-long-long -Wimplicit-fallthrough -Wno-maybe-uninitialized -Wno-class-memaccess -Wno-redundant-move -Wno-pessimizing-move -Wno-noexcept-type -Wdelete-non-virtual-dtor -Wsuggest-override -Wno-comment -Wmisleading-indentation -ffunction-sections -fdata-sections  -std=c++11  -Wall  -Wextra  -Wshadow  -Wsuggest-override  -pedantic  -pedantic-errors  -fstrict-aliasing  -Wno-deprecated-declarations  -fno-exceptions  -Wstrict-aliasing  -wd654   -wd654 -std=c++14 -o CMakeFiles/cmTC_abb79.dir/src.cxx.o -c /home/andreagenor/code/external/llvm/build/CMakeFiles/CMakeTmp/src.cxx
c++: error: unrecognized command-line option '-wd654'
c++: error: unrecognized command-line option '-wd654'
gmake[1]: *** [CMakeFiles/cmTC_abb79.dir/build.make:78: CMakeFiles/cmTC_abb79.dir/src.cxx.o] Error 1
gmake[1]: Leaving directory '/home/andreagenor/code/external/llvm/build/CMakeFiles/CMakeTmp'
gmake: *** [Makefile:127: cmTC_abb79/fast] Error 2


Source file was:
int main() { return 0; }
Performing C++ SOURCE FILE Test HAVE_CXX_FLAG_WTHREAD_SAFETY failed with the following output:
Change Dir: /home/andreagenor/code/external/llvm/build/CMakeFiles/CMakeTmp

Run Build Command(s):/usr/bin/gmake -f Makefile cmTC_32fa0/fast && /usr/bin/gmake  -f CMakeFiles/cmTC_32fa0.dir/build.make CMakeFiles/cmTC_32fa0.dir/build
gmake[1]: Entering directory '/home/andreagenor/code/external/llvm/build/CMakeFiles/CMakeTmp'
Building CXX object CMakeFiles/cmTC_32fa0.dir/src.cxx.o
/usr/bin/c++ -DHAVE_CXX_FLAG_WTHREAD_SAFETY  -fPIC -fno-semantic-interposition -fvisibility-inlines-hidden -Werror=date-time -Wall -Wextra -Wno-unused-parameter -Wwrite-strings -Wcast-qual -Wno-missing-field-initializers -pedantic -Wno-long-long -Wimplicit-fallthrough -Wno-maybe-uninitialized -Wno-class-memaccess -Wno-redundant-move -Wno-pessimizing-move -Wno-noexcept-type -Wdelete-non-virtual-dtor -Wsuggest-override -Wno-comment -Wmisleading-indentation -ffunction-sections -fdata-sections  -std=c++11  -Wall  -Wextra  -Wshadow  -Wsuggest-override  -pedantic  -pedantic-errors  -fstrict-aliasing  -Wno-deprecated-declarations  -fno-exceptions  -Wstrict-aliasing  -Wthread-safety   -Wthread-safety -std=c++14 -o CMakeFiles/cmTC_32fa0.dir/src.cxx.o -c /home/andreagenor/code/external/llvm/build/CMakeFiles/CMakeTmp/src.cxx
c++: error: unrecognized command-line option '-Wthread-safety'
c++: error: unrecognized command-line option '-Wthread-safety'
gmake[1]: *** [CMakeFiles/cmTC_32fa0.dir/build.make:78: CMakeFiles/cmTC_32fa0.dir/src.cxx.o] Error 1
gmake[1]: Leaving directory '/home/andreagenor/code/external/llvm/build/CMakeFiles/CMakeTmp'
gmake: *** [Makefile:127: cmTC_32fa0/fast] Error 2


Source file was:
int main() { return 0; }